BDBM50466683 CHEMBL4293778
SMILES CC1(CCc2ccc(cc12)-c1ncnc2[nH]ccc12)NC#N
InChI Key InChIKey=PTCVBQDKOCSZKC-UHFFFAOYSA-N
Data  6 IC50
PDB links: 1 PDB ID matches this monomer.
  Tab Delimited (TSV)   2D SDfile   Computed 3D by Vconf -m prep SDfile
Find this compound or compounds like it in BindingDB:
Activity Spreadsheet -- Enzyme Inhibition Constant Data from BindingDB
Found 1 hit for monomerid = 50466683
TargetNon-receptor tyrosine-protein kinase TYK2(Homo sapiens (Human))
Pfizer
Curated by ChEMBL
LigandPNGBDBM50466683(CHEMBL4293778)
Affinity DataIC50:  239nM. Assay description: Inhibition of recombinant human His-tagged TYK2 expressed in SF21/baculovirus expression system using KAIETDKEYYTVKD-NH2 as substrate in presence of ...
Ligand InfoPC cidPC sidPDB
In DepthDetails ArticlePubMed